{"text_format":"1","workbook":"xlsx","n_sheets":12,"sheets":["Menu","Summary Instructions","Data Capture Demand","Data Capture Users","Data Capture Costs","Primary Baseline Tariff","Adj Primary Baseline Tariff","Strategic Decisions","Revised Primary Baseline Tariff","Test Afford of Variable Tariff","Test Afford of Fixed Tariff","Summary of Tariff Comparisons"],"not_rendered":{"charts":0,"images":1,"macros":1,"external_links":1,"defined_names":12,"comments":0,"pivot_tables":0},"unopened":[],"bounds":{"document_bytes":16777216,"sheet_cells":100000,"rows_first":2000,"rows_last":500,"rows_between":2000,"halvings":0,"cell_chars":16384,"cell_head_chars":4096},"cells_cut":0,"cells_raw":0,"read":"whole","date_system":"1900"}

{"sheet":"Menu","index":0,"n_rows":5,"n_cols":10,"rows_kept":5,"cut":false,"hidden":false,"merged":[[2,3,2,5],[3,3,3,5],[4,3,4,5]]}
[]
[]
[null,null,null,"WATER"]
[null,null,null,"SubMenu",null,null,null,null,null,{"$f":"[1]Menu!$I$4","v":"SA RANDS"}]
[null,null,null,null,null,null,null,null,null,{"$f":"[1]Menu!$I$5","v":2011}]

{"sheet":"Summary Instructions","index":1,"n_rows":85,"n_cols":6,"rows_kept":85,"cut":false,"hidden":false,"merged":[[67,2,67,7],[2,2,2,7],[47,2,47,7],[52,2,53,2],[56,2,57,2],[7,2,7,7],[22,2,22,7],[38,2,38,7],[14,5,14,7],[28,5,28,7],[44,5,44,7]]}
[]
[]
[null,null,"WATER - SUMMARY INSTRUCTIONS"]
[]
[null,null,null,"Capture  anticipated and current Consumption Level Data for Tariff Consumer Groups on this screen."]
[]
[]
[null,null,"Any cell with this background colour is a DATA INPUT cell."]
[]
[null,null,"Data Required"]
{"$rows_left_out":76}
{"sheet":"Data Capture Demand","index":2,"n_rows":55,"n_cols":8,"rows_kept":55,"cut":false,"hidden":false,"merged":[[4,6,4,7],[6,6,6,7],[6,2,6,4],[2,2,2,7],[4,2,4,4]]}
[]
[]
[null,null,{"$f":"Menu!D3&\" - DATA CAPTURE: DEMAND PER YEAR\"","v":"WATER - DATA CAPTURE: DEMAND PER YEAR"}]
[]
[null,null,"FUTURE DEMAND",null,null,null,"HISTORICAL DEMAND"]
[]
[null,null,{"$f":"\"Financial Year:\"&\" \"&Menu!$J$5&\"\\\"&Menu!$J$5+1","v":"Financial Year: 2011\\2012"},null,null,null,{"$f":"Menu!$J$5-1&\"\\\"&Menu!$J$5","v":"2010\\2011"}]
[null,null,"CONSUMER","CONSUMPTION LEVEL","KL WATER DEMAND",null,"KL WATER CONSUMPTION","CURRENT ACTUAL TARIFF per KL"]
[null,null,"DOMESTIC (LOW INCOME)"]
[null,null,"Domestic (Free Basic Water) Consumption","Consumption 0KL to 6KL",490000,null,450000,{"$f":"H14","v":5}]
{"$rows_left_out":46}
{"sheet":"Data Capture Users","index":3,"n_rows":35,"n_cols":7,"rows_kept":35,"cut":false,"hidden":false,"merged":[[6,2,6,3],[6,5,6,6],[4,5,4,6],[2,2,2,6]]}
[]
[]
[null,null,{"$f":"Menu!D3&\" - DATA CAPTURE: USERS PER YEAR\"","v":"WATER - DATA CAPTURE: USERS PER YEAR"}]
[]
[null,null,"FUTURE NUMBER OF USERS",null,null,"HISTORICAL USERS"]
[]
[null,null,{"$f":"\"Financial Year:\"&\" \"&Menu!$J$5&\"\\\"&Menu!$J$5+1","v":"Financial Year: 2011\\2012"},null,null,{"$f":"Menu!$J$5-1&\"\\\"&Menu!$J$5","v":"2010\\2011"}]
[null,null,"CONSUMER","NO OF STANDS",null,"NO OF STANDS","CURRENT ACTUAL TARIFF per Stand per Year"]
[null,null,"DOMESTIC (LOW INCOME)"]
[null,null,"Domestic (Free Basic Water) Consumers",2200,null,2000,{"$f":"G15","v":480}]
{"$rows_left_out":26}
{"sheet":"Data Capture Costs","index":4,"n_rows":101,"n_cols":53,"rows_kept":101,"cut":false,"hidden":false,"merged":[[9,5,10,5],[9,6,10,6],[2,2,2,6],[9,3,9,4]]}
[null,null,null,null,null,null,null,null,null,null,null,null,null,null,null,null,null,null,null,null,null,null,null,null,null,null,null,null,null,null,null,null,null,null,null,null,null,null,null,null,null,null,null,null,null,null,null,null,null,null,null,null,0]
[null,null,null,null,null,null,null,null,null,null,null,null,null,null,null,null,null,null,null,null,null,null,null,null,null,null,null,null,null,null,null,null,null,null,null,null,null,null,null,null,null,null,null,null,null,null,null,null,null,null,null,null,0.01]
[null,null,{"$f":"Menu!D3&\" - DATA CAPTURE: COSTS BY BUDGET VOTE\"","v":"WATER - DATA CAPTURE: COSTS BY BUDGET VOTE"},null,null,null,null,null,null,null,null,null,null,null,null,null,null,null,null,null,null,null,null,null,null,null,null,null,null,null,null,null,null,null,null,null,null,null,null,null,null,null,null,null,null,null,null,null,null,null,null,null,0.02]
[null,null,null,null,null,null,null,null,null,null,null,null,null,null,null,null,null,null,null,null,null,null,null,null,null,null,null,null,null,null,null,null,null,null,null,null,null,null,null,null,null,null,null,null,null,null,null,null,null,null,null,null,0.03]
[null,null,"SUMMARY",{"$f":"Menu!J4","v":"SA RANDS"},null,null,null,null,null,null,null,null,null,null,null,null,null,null,null,null,null,null,null,null,null,null,null,null,null,null,null,null,null,null,null,null,null,null,null,null,null,null,null,null,null,null,null,null,null,null,null,null,0.04]
[null,null,"TOTAL VARIABLE COSTS",{"$f":"SUMPRODUCT($E$12:$E$33,$F$12:$F$33)","v":13970000},null,null,null,null,null,null,null,null,null,null,null,null,null,null,null,null,null,null,null,null,null,null,null,null,null,null,null,null,null,null,null,null,null,null,null,null,null,null,null,null,null,null,null,null,null,null,null,null,0.05]
[null,null,"TOTAL FIXED FACILITY COSTS",{"$f":"SUMPRODUCT($E$12:$E$33,$G$12:$G$33)","v":3479999.9999999995},null,null,null,null,null,null,null,null,null,null,null,null,null,null,null,null,null,null,null,null,null,null,null,null,null,null,null,null,null,null,null,null,null,null,null,null,null,null,null,null,null,null,null,null,null,null,null,null,0.06]
[null,null,"TOTAL RING FENCED COSTS",{"$f":"SUM(D6:D7)","v":17450000},null,null,null,null,null,null,null,null,null,null,null,null,null,null,null,null,null,null,null,null,null,null,null,null,null,null,null,null,null,null,null,null,null,null,null,null,null,null,null,null,null,null,null,null,null,null,null,null,7.0000000000000007E-2]
[null,null,null,null,null,null,null,null,null,null,null,null,null,null,null,null,null,null,null,null,null,null,null,null,null,null,null,null,null,null,null,null,null,null,null,null,null,null,null,null,null,null,null,null,null,null,null,null,null,null,null,null,0.08]
[null,null,"COSTS BY BUDGET VOTE",{"$f":"Menu!J4","v":"SA RANDS"},null,"Share of Variable Costs","Share of Fixed Costs",null,null,null,null,null,null,null,null,null,null,null,null,null,null,null,null,null,null,null,null,null,null,null,null,null,null,null,null,null,null,null,null,null,null,null,null,null,null,null,null,null,null,null,null,null,0.09]
{"$rows_left_out":92}
{"sheet":"Primary Baseline Tariff","index":5,"n_rows":13,"n_cols":4,"rows_kept":13,"cut":false,"hidden":false,"merged":[[4,2,4,3],[2,2,2,3]]}
[]
[]
[null,null,"PRIMARY BASELINE TARIFF"]
[]
[null,null,"Below is a basic tariff calculated per baseline unit. This is a tariff that is the same for all consumers. Note: Water has a fixed and a variable component."]
[]
[null,null,"DETAIL","AMT"]
[null,null,{"$f":"'Data Capture Costs'!C6","v":"TOTAL VARIABLE COSTS"},{"$f":"'Data Capture Costs'!$D$6","v":13970000}]
[null,null,{"$f":"'Data Capture Demand'!C55","v":"TOTAL KL WATER DEMAND"},{"$f":"'Data Capture Demand'!E55","v":2122000}]
[null,null,"Tariff per KL Water Consumption ",{"$f":"IF(D8=0,0,D8/D9)","v":6.5834118755890669}]
{"$rows_left_out":4}
{"sheet":"Adj Primary Baseline Tariff","index":6,"n_rows":13,"n_cols":11,"rows_kept":13,"cut":false,"hidden":false,"merged":[[2,9,2,10],[8,9,8,10],[2,2,2,3],[4,2,4,3],[2,7,2,8],[8,7,8,8]]}
[]
[]
[null,null,"ADJUSTED PRIMARY BASELINE TARIFF",null,null,null,null,"COST TO FREE BASIC WATER",null,{"$f":"Menu!$J$4","v":"SA RANDS"}]
[null,null,null,null,null,null,null,{"$f":"'Data Capture Demand'!C8","v":"CONSUMER"},{"$f":"'Data Capture Demand'!E8","v":"KL WATER DEMAND"},"REVENUE","FREE BASIC WATER COST"]
[null,null,"Adjusted Primary Baseline Tariff after costing Free Basic Water.",null,null,null,null,{"$f":"C9","v":"OTHER CONSUMPTION"},{"$f":"SUM('Data Capture Demand'!$E$20+'Data Capture Demand'!$E$32+'Data Capture Demand'!$E$40+'Data Capture Demand'!$E$53)","v":1632000},{"$f":"'Data Capture Costs'!D6","v":13970000},0]
[null,null,null,null,null,null,null,{"$f":"'Data Capture Demand'!C10","v":"Domestic (Free Basic Water) Consumption"},{"$f":"'Data Capture Demand'!E11","v":490000},0,{"$f":"I6*'Primary Baseline Tariff'!D10","v":3225871.8190386426}]
[null,null,"DETAIL","AMT",null,null,null,{"$f":"'Data Capture Demand'!C55","v":"TOTAL KL WATER DEMAND"},{"$f":"'Data Capture Demand'!E55","v":2122000},{"$f":"SUM(J5:J6)","v":13970000},{"$f":"SUM(K5:K6)","v":3225871.8190386426}]
[null,null,{"$f":"'Primary Baseline Tariff'!C8","v":"TOTAL VARIABLE COSTS"},{"$f":"'Data Capture Costs'!$D$6","v":13970000}]
[null,null,"OTHER CONSUMPTION",{"$f":"SUM('Data Capture Demand'!$E$20+'Data Capture Demand'!$E$32+'Data Capture Demand'!$E$40+'Data Capture Demand'!$E$53)","v":1632000},null,null,null,"FIXED AVAILABILITY FEES",null,{"$f":"Menu!$J$4","v":"SA RANDS"}]
[null,null,{"$f":"'Primary Baseline Tariff'!C10","v":"Tariff per KL Water Consumption "},{"$f":"IF(D8=0,0,D8/D9)","v":8.5600490196078436},null,null,null,{"$f":"'Data Capture Users'!C8","v":"CONSUMER"},{"$f":"'Data Capture Users'!D8","v":"NO OF STANDS"},"REVENUE","FREE BASIC WATER COST"]
{"$rows_left_out":4}
{"sheet":"Strategic Decisions","index":7,"n_rows":24,"n_cols":56,"rows_kept":24,"cut":false,"hidden":false,"merged":[[4,9,6,9],[2,2,2,5],[12,9,14,9],[14,2,14,5]]}
[null,null,null,null,null,null,null,null,null,null,null,null,null,null,null,null,null,null,null,null,null,null,null,null,null,null,null,null,null,null,null,null,null,null,null,null,null,null,null,null,null,null,null,null,null,null,null,null,null,null,null,null,null,null,null,"Yes"]
[]
[null,null,"STRATEGIC DECISIONS"]
[null,null,null,null,null,null,null,null,null,null,null,null,null,null,null,null,null,null,null,null,null,null,null,null,null,null,null,null,null,null,null,null,null,null,null,null,null,null,null,null,null,null,null,null,null,null,null,null,null,null,null,null,null,null,null,"No"]
[null,null,"FINANCIAL DECISIONS","AMOUNT","%","% AMT",null,null,null,"REVISED PRIMARY BASELINE TARIFF"]
[null,1,"Do you wish to achieve a Surplus on this service?","YES"]
[null,null,null,"NO"]
[null,null,"Enter Size of the Surplus",0,10,{"$f":"E8%*'Data Capture Costs'!D6","v":1397000},null,null,null,{"$f":"'Revised Primary Baseline Tariff'!D10","v":9.4160539215686274}]
[]
[null,2,"Are you willing to make a Deficit on this service?","YES"]
{"$rows_left_out":15}
{"sheet":"Revised Primary Baseline Tariff","index":8,"n_rows":13,"n_cols":4,"rows_kept":13,"cut":false,"hidden":false,"merged":[[2,2,2,3],[4,2,4,3]]}
[]
[]
[null,null,"REVISED PRIMARY BASELINE TARIFF"]
[]
[null,null,"After Strategic Decisions this is the revised tariff."]
[]
[null,null,"DETAIL","AMT"]
[null,null,{"$f":"'Adj Primary Baseline Tariff'!C8","v":"TOTAL VARIABLE COSTS"},{"$f":"'Adj Primary Baseline Tariff'!D8+'Strategic Decisions'!J20","v":15367000}]
[null,null,{"$f":"'Adj Primary Baseline Tariff'!C9","v":"OTHER CONSUMPTION"},{"$f":"'Adj Primary Baseline Tariff'!$D$9","v":1632000}]
[null,null,{"$f":"'Primary Baseline Tariff'!C10","v":"Tariff per KL Water Consumption "},{"$f":"IF(D$8=0,0,D8/D$9)","v":9.4160539215686274}]
{"$rows_left_out":4}
{"sheet":"Test Afford of Variable Tariff","index":9,"n_rows":60,"n_cols":16,"rows_kept":60,"cut":false,"hidden":false,"merged":[[45,5,45,6],[45,11,45,12],[2,2,2,15],[4,5,4,6],[4,10,4,12],[4,2,5,2],[4,3,5,3],[4,4,5,4],[4,7,4,8]]}
[]
[]
[null,null,"CURRENT & REVISED TARIFF COMPARISON: VARIABLE CONSUMPTION"]
[]
[null,null,{"$f":"'Data Capture Demand'!C8","v":"CONSUMER"},{"$f":"'Data Capture Demand'!D8","v":"CONSUMPTION LEVEL"},{"$f":"'Data Capture Demand'!E8&\" (\"&Menu!J4&\")\"","v":"KL WATER DEMAND (SA RANDS)"},"CURRENT ACTUAL",null,"REVISED TARIFF",null,null,"AFFORDABILITY ADJUSTMENT TO REVISED PRIMARY BASELINE",null,null,null,"Current Actual - Revised","PROFIT\\LOSS"]
[null,null,null,null,null,"TARIFF","REVENUE","TARIFF","REVENUE",null,"% CHANGE","TARIFF","REVENUE",null,"TARIFF","REVENUE"]
[null,null,{"$f":"IF('Data Capture Demand'!C10=\"\",\"\",'Data Capture Demand'!C10)","v":"Domestic (Free Basic Water) Consumption"},{"$f":"IF('Data Capture Demand'!D10=\"\",\"\",'Data Capture Demand'!D10)","v":"Consumption 0KL to 6KL"},{"$f":"'Data Capture Demand'!E10","v":490000},0,{"$f":"SUM('Data Capture Demand'!G10*F7)","v":0},0,{"$f":"SUM(E7*H7)","v":0},0,0,{"$f":"SUM(H7*K7%)+H7","v":0},{"$f":"E7*L7","v":0},null,{"$f":"L7-F7","v":0},{"$f":"M7-G7","v":0}]
[null,null,{"$f":"'Data Capture Demand'!C9&\" TOTAL\"","v":"DOMESTIC (LOW INCOME) TOTAL"},null,{"$f":"SUM(E7)","v":490000},null,{"$f":"SUM(G7)","v":0},null,{"$f":"SUM(I7)","v":0},null,0,null,{"$f":"SUM(M7)","v":0},null,null,{"$f":"SUM(P7)","v":0}]
[null,null,{"$f":"IF('Data Capture Demand'!C14=\"\",\"\",'Data Capture Demand'!C14)","v":"Consumption 7KL to 15KL"},{"$f":"IF('Data Capture Demand'!D14=\"\",\"\",'Data Capture Demand'!D14)","v":"Consumption 7KL to 15KL"},{"$f":"'Data Capture Demand'!E14","v":450000},{"$f":"'Data Capture Demand'!H14","v":5},{"$f":"SUM('Data Capture Demand'!G14*F9)","v":2000000},{"$f":"'Revised Primary Baseline Tariff'!$D$10","v":9.4160539215686274},{"$f":"SUM(E9*H9)","v":4237224.2647058824},0,0,{"$f":"SUM(H9*K9%)+H9","v":9.4160539215686274},{"$f":"E9*L9","v":4237224.2647058824},null,{"$f":"L9-F9","v":4.4160539215686274},{"$f":"M9-G9","v":2237224.2647058824}]
[null,null,{"$f":"IF('Data Capture Demand'!C15=\"\",\"\",'Data Capture Demand'!C15)","v":"Consumption 16KL to 30KL"},{"$f":"IF('Data Capture Demand'!D15=\"\",\"\",'Data Capture Demand'!D15)","v":"Consumption 16KL to 30KL"},{"$f":"'Data Capture Demand'!E15","v":350000},{"$f":"'Data Capture Demand'!H15","v":8},{"$f":"SUM('Data Capture Demand'!G15*F10)","v":2800000},{"$f":"'Revised Primary Baseline Tariff'!$D$10","v":9.4160539215686274},3295618.8725490198,0,0,9.4160539215686274,3295618.8725490198,null,{"$f":"L10-F10","v":1.4160539215686274},{"$f":"M10-G10","v":495618.87254901975}]
{"$rows_left_out":51}
{"sheet":"Test Afford of Fixed Tariff","index":10,"n_rows":28,"n_cols":16,"rows_kept":28,"cut":false,"hidden":false,"merged":[[25,5,25,6],[25,11,25,12],[2,2,2,15],[4,2,5,2],[4,3,5,3],[4,4,5,4],[4,5,4,6],[4,7,4,8],[4,10,4,12]]}
[]
[]
[null,null,"CURRENT & REVISED TARIFF COMPARISON: FIXED FACILITY PER YEAR"]
[]
[null,null,{"$f":"'Data Capture Demand'!C8","v":"CONSUMER"},{"$f":"'Data Capture Demand'!D8","v":"CONSUMPTION LEVEL"},{"$f":"'Data Capture Demand'!E8&\" (\"&Menu!J4&\")\"","v":"KL WATER DEMAND (SA RANDS)"},"CURRENT ACTUAL",null,"REVISED TARIFF",null,null,"AFFORDABILITY ADJUSTMENT TO REVISED PRIMARY BASELINE",null,null,null,"Current Actual - Revised","PROFIT\\LOSS"]
[null,null,null,null,null,"TARIFF","REVENUE","TARIFF","REVENUE",null,"% CHANGE","TARIFF","REVENUE",null,"TARIFF","REVENUE"]
[null,null,{"$f":"IF('Data Capture Users'!C10=\"\",\"\",'Data Capture Users'!C10)","v":"Domestic (Free Basic Water) Consumers"},null,{"$f":"'Data Capture Users'!D10","v":2200},0,{"$f":"'Data Capture Users'!F10*F7","v":0},0,{"$f":"SUM(E7*H7)","v":0},null,0,{"$f":"SUM(H7*K7%)+H7","v":0},{"$f":"E7*L7","v":0},null,{"$f":"L7-F7","v":0},{"$f":"M7-G7","v":0}]
[null,null,{"$f":"'Data Capture Users'!C9&\" TOTAL\"","v":"DOMESTIC (LOW INCOME) TOTAL"},null,{"$f":"SUM(E7)","v":2200},null,{"$f":"SUM(G7)","v":0},null,{"$f":"SUM(I7)","v":0},null,null,null,{"$f":"SUM(M7)","v":0},null,null,{"$f":"SUM(P7)","v":0}]
[null,null,{"$f":"IF('Data Capture Users'!C14=\"\",\"\",'Data Capture Users'!C14)","v":"Availablility Fees for Vacant Stands"},null,{"$f":"'Data Capture Users'!D14","v":900},{"$f":"'Data Capture Users'!G14","v":480},{"$f":"'Data Capture Users'!F14*F9","v":480000},{"$f":"'Revised Primary Baseline Tariff'!$D$13","v":316.36363636363632},{"$f":"SUM(E9*H9)","v":284727.27272727271},null,50,{"$f":"SUM(H9*K9%)+H9","v":474.5454545454545},{"$f":"E9*L9","v":427090.90909090906},null,{"$f":"L9-F9","v":-5.4545454545454959},{"$f":"M9-G9","v":-52909.090909090941}]
[null,null,{"$f":"IF('Data Capture Users'!C15=\"\",\"\",'Data Capture Users'!C15)","v":"Basic Fees from Number of Domestic Consumers"},null,{"$f":"'Data Capture Users'!D15","v":10100},{"$f":"'Data Capture Users'!G15","v":480},{"$f":"'Data Capture Users'!F15*F10","v":4800000},{"$f":"'Revised Primary Baseline Tariff'!$D$13","v":316.36363636363632},{"$f":"SUM(E10*H10)","v":3195272.7272727266},null,50,{"$f":"SUM(H10*K10%)+H10","v":474.5454545454545},{"$f":"E10*L10","v":4792909.0909090908},null,{"$f":"L10-F10","v":-5.4545454545454959},-7090.9090909091756]
{"$rows_left_out":19}
{"sheet":"Summary of Tariff Comparisons","index":11,"n_rows":15,"n_cols":16,"rows_kept":15,"cut":false,"hidden":false,"merged":[[12,5,12,6],[12,11,12,12],[2,2,2,15],[4,2,5,2],[4,3,5,3],[4,4,5,4],[4,5,4,6],[4,7,4,8],[4,10,4,12]]}
[]
[]
[null,null,"SUMMARY: VARIABLE & FIXED PROFIT AND LOSS PER YEAR"]
[]
[null,null,{"$f":"'Data Capture Demand'!C8","v":"CONSUMER"},{"$f":"'Data Capture Demand'!D8","v":"CONSUMPTION LEVEL"},{"$f":"'Data Capture Demand'!E8&\" (\"&Menu!J4&\")\"","v":"KL WATER DEMAND (SA RANDS)"},"CURRENT ACTUAL",null,"REVISED TARIFF",null,null,"AFFORDABILITY ADJUSTMENT  TO REVISED PRIMARY BASELINE",null,null,null,"Current Actual - Revised","PROFIT\\LOSS"]
[null,null,null,null,null,"TARIFF","REVENUE","TARIFF","REVENUE",null,"% CHANGE","TARIFF","REVENUE",null,"TARIFF","REVENUE"]
[]
[null,null,"TOTAL VARIABLE CONSUMPTION",null,{"$f":"'Test Afford of Variable Tariff'!E44","v":1632000},null,{"$f":"'Test Afford of Variable Tariff'!G44","v":14205000},null,{"$f":"'Test Afford of Variable Tariff'!I44","v":15367000},null,null,null,{"$f":"'Test Afford of Variable Tariff'!M44","v":15367000},null,null,{"$f":"'Test Afford of Variable Tariff'!P44","v":1162000}]
[]
[]
{"$rows_left_out":5}