{"text_format":"1","workbook":"xlsx","n_sheets":12,"sheets":["Menu","Summary Instructions","Data Capture Demand","Data Capture Users","Data Capture Costs","Primary Baseline Tariff","Adj Primary Baseline Tariff","Strategic Decisions","Revised Primary Baseline Tariff","Test Afford of Variable Tariff","Test Afford of Fixed Tariff","Summary of Tariff Comparison"],"not_rendered":{"charts":0,"images":1,"macros":1,"external_links":1,"defined_names":14,"comments":0,"pivot_tables":0},"unopened":[],"bounds":{"document_bytes":16777216,"sheet_cells":100000,"rows_first":2000,"rows_last":500,"rows_between":2000,"halvings":0,"cell_chars":16384,"cell_head_chars":4096},"cells_cut":0,"cells_raw":0,"read":"whole","date_system":"1900"}

{"sheet":"Menu","index":0,"n_rows":5,"n_cols":10,"rows_kept":5,"cut":false,"hidden":false,"merged":[[2,3,2,5],[3,3,3,5],[4,3,4,5]]}
[]
[]
[null,null,null,"ELECTRICITY"]
[null,null,null,"SubMenu",null,null,null,null,null,{"$f":"[1]Menu!$I$4","v":"SA RANDS"}]
[null,null,null,null,null,null,null,null,null,{"$f":"[1]Menu!$I$5","v":2011}]

{"sheet":"Summary Instructions","index":1,"n_rows":86,"n_cols":6,"rows_kept":86,"cut":false,"hidden":false,"merged":[[67,2,67,7],[2,2,2,7],[46,2,46,7],[52,2,53,2],[56,2,57,2],[7,2,7,7],[22,2,22,7],[37,2,37,7],[14,5,14,7],[28,5,28,7],[43,5,43,7],[47,3,47,7],[33,3,34,4]]}
[]
[]
[null,null,"ELECTRICITY - SUMMARY INSTRUCTIONS"]
[]
[null,null,null,"Capture  anticipated and current Consumption Level Data for Tariff Consumer Groups on this screen."]
[]
[]
[null,null,"Any cell with this background colour is a DATA INPUT cell."]
[]
[null,null,"Data Required"]
{"$rows_left_out":77}
{"sheet":"Data Capture Demand","index":2,"n_rows":131,"n_cols":14,"rows_kept":131,"cut":false,"hidden":false,"merged":[[130,2,130,3],[4,6,4,7],[6,6,6,7],[6,2,6,4],[2,2,2,7],[4,2,4,4]]}
[]
[]
[null,null,"ELECTRICITY - DATA CAPTURE: DEMAND PER YEAR"]
[]
[null,null,"FUTURE DEMAND",null,null,null,"HISTORICAL DEMAND"]
[]
[null,null,{"$f":"\"Financial Year: \"&Menu!J5&\"\\\"&Menu!J5+1","v":"Financial Year: 2011\\2012"},null,null,null,{"$f":"Menu!J5-1&\"\\\"&Menu!J5","v":"2010\\2011"}]
[null,null,"CONSUMER","CONSUMPTION LEVEL","UNITS OF DEMAND",null,"UNITS OF DEMAND","CURRENT ACTUAL TARIFF  PER UNIT"]
[null,1,"DOMESTIC - LOW INCOME (KwH)"]
[null,null,"Domestic Low Income Pre-paid",null,2750000,null,2500000,{"$f":"H15","v":0.78},null,null,null,null,null,{"$f":"G10*H10","v":1950000}]
{"$rows_left_out":122}
{"sheet":"Data Capture Users","index":3,"n_rows":44,"n_cols":12,"rows_kept":44,"cut":false,"hidden":false,"merged":[[6,5,6,6],[4,5,4,6],[2,2,2,6],[4,2,4,3],[6,2,6,3]]}
[]
[]
[null,null,"ELECTRICITY - DATA CAPTURE: USERS PER YEAR"]
[]
[null,null,"FUTURE NUMBER OF STANDS",null,null,"HISTORICAL NUMBER OF STANDS"]
[]
[null,null,{"$f":"\"Financial Year: \"&Menu!J5&\"\\\"&Menu!J5+1","v":"Financial Year: 2011\\2012"},null,null,{"$f":"Menu!J5-1&\"\\\"&Menu!J5","v":"2010\\2011"}]
[null,null,"CONSUMER","NO OF STANDS",null,"NO OF STANDS","CURRENT ACTUAL TARIFF PER STAND"]
[null,null,"DOMESTIC - LOW INCOME (KwH)"]
[null,null,"Domestic Low Income Pre-paid",2200,null,2000,{"$f":"G16","v":0},null,null,null,null,{"$f":"F10*G10","v":0}]
{"$rows_left_out":35}
{"sheet":"Data Capture Costs","index":4,"n_rows":99,"n_cols":53,"rows_kept":99,"cut":false,"hidden":false,"merged":[[39,2,39,4],[51,2,51,3],[9,5,10,5],[9,6,10,6],[2,2,2,6],[9,3,9,4],[40,2,40,3],[46,2,46,3],[47,2,47,3],[48,2,48,3],[49,2,49,3],[50,2,50,3],[41,2,41,3],[42,2,42,3],[43,2,43,3],[44,2,44,3],[45,2,45,3],[52,2,52,3],[53,2,53,3],[54,2,54,3],[68,2,68,3],[62,2,62,3],[64,2,64,3],[65,2,65,3],[66,2,66,3],[67,2,67,3],[63,2,63,3],[58,1,58,5],[59,2,59,3],[60,2,60,3],[61,2,61,3],[55,2,55,3],[74,2,74,3],[69,2,69,3],[70,2,70,3],[71,2,71,3],[72,2,72,3],[73,2,73,3]]}
[null,null,null,null,null,null,null,null,null,null,null,null,null,null,null,null,null,null,null,null,null,null,null,null,null,null,null,null,null,null,null,null,null,null,null,null,null,null,null,null,null,null,null,null,null,null,null,null,null,null,null,null,0]
[null,null,null,null,null,null,null,null,null,null,null,null,null,null,null,null,null,null,null,null,null,null,null,null,null,null,null,null,null,null,null,null,null,null,null,null,null,null,null,null,null,null,null,null,null,null,null,null,null,null,null,null,0.01]
[null,null,{"$f":"Menu!D3&\" - DATA CAPTURE: COSTS BY BUDGET VOTE\"","v":"ELECTRICITY - DATA CAPTURE: COSTS BY BUDGET VOTE"},null,null,null,null,null,null,null,null,null,null,null,null,null,null,null,null,null,null,null,null,null,null,null,null,null,null,null,null,null,null,null,null,null,null,null,null,null,null,null,null,null,null,null,null,null,null,null,null,null,0.02]
[null,null,null,null,null,null,null,null,null,null,null,null,null,null,null,null,null,null,null,null,null,null,null,null,null,null,null,null,null,null,null,null,null,null,null,null,null,null,null,null,null,null,null,null,null,null,null,null,null,null,null,null,0.03]
[null,null,"SUMMARY",{"$f":"Menu!J4","v":"SA RANDS"},null,null,null,null,null,null,null,null,null,null,null,null,null,null,null,null,null,null,null,null,null,null,null,null,null,null,null,null,null,null,null,null,null,null,null,null,null,null,null,null,null,null,null,null,null,null,null,null,0.04]
[null,null,"TOTAL VARIABLE COSTS",{"$f":"SUMPRODUCT($E$12:$E$33,$F$12:$F$33)","v":20945000},null,null,null,null,null,null,null,null,null,null,null,null,null,null,null,null,null,null,null,null,null,null,null,null,null,null,null,null,null,null,null,null,null,null,null,null,null,null,null,null,null,null,null,null,null,null,null,null,0.05]
[null,null,"TOTAL FIXED FACILITY COSTS",{"$f":"SUMPRODUCT($E$12:$E$33,$G$12:$G$33)","v":8105000},null,null,null,null,null,null,null,null,null,null,null,null,null,null,null,null,null,null,null,null,null,null,null,null,null,null,null,null,null,null,null,null,null,null,null,null,null,null,null,null,null,null,null,null,null,null,null,null,0.06]
[null,null,"TOTAL RING FENCED COSTS",{"$f":"SUM(D6:D7)","v":29050000},null,null,null,null,null,null,null,null,null,null,null,null,null,null,null,null,null,null,null,null,null,null,null,null,null,null,null,null,null,null,null,null,null,null,null,null,null,null,null,null,null,null,null,null,null,null,null,null,7.0000000000000007E-2]
[null,null,null,null,null,null,null,null,null,null,null,null,null,null,null,null,null,null,null,null,null,null,null,null,null,null,null,null,null,null,null,null,null,null,null,null,null,null,null,null,null,null,null,null,null,null,null,null,null,null,null,null,0.08]
[null,null,"COSTS BY BUDGET VOTE",{"$f":"Menu!J4","v":"SA RANDS"},null,"Share of Variable Costs","Share of Fixed Costs",null,null,null,null,null,null,null,null,null,null,null,null,null,null,null,null,null,null,null,null,null,null,null,null,null,null,null,null,null,null,null,null,null,null,null,null,null,null,null,null,null,null,null,null,null,0.09]
{"$rows_left_out":90}
{"sheet":"Primary Baseline Tariff","index":5,"n_rows":26,"n_cols":4,"rows_kept":26,"cut":false,"hidden":false,"merged":[[4,2,4,3],[2,2,2,3]]}
[]
[]
[null,null,"PRIMARY BASELINE TARIFF"]
[]
[null,null,"Below is a basic tariff calculated per baseline unit. Note: Electricity has a fixed and a variable component."]
[]
[null,null,"VARIABLE COSTS PER CONSUMER GROUP","TARIFF"]
[null,1,{"$f":"IF('Data Capture Costs'!C42=\"\",\"\",'Data Capture Costs'!C42)","v":"DOMESTIC - LOW INCOME (KwH)"},{"$f":"IF('Data Capture Demand'!E12=0,0,'Data Capture Costs'!J42/'Data Capture Demand'!E12)","v":0.8429006294500051}]
[null,2,{"$f":"IF('Data Capture Costs'!C43=\"\",\"\",'Data Capture Costs'!C43)","v":"DOMESTIC - PRE-PAID (KwH)"},{"$f":"IF('Data Capture Demand'!E21=0,0,'Data Capture Costs'!J43/'Data Capture Demand'!E21)","v":0.92266228852494458}]
[null,3,{"$f":"IF('Data Capture Costs'!C44=\"\",\"\",'Data Capture Costs'!C44)","v":"DOMESTIC - METERED SINGLE PHASE (KwH)"},{"$f":"IF('Data Capture Demand'!E30=0,0,'Data Capture Costs'!J44/'Data Capture Demand'!E30)","v":1.0503838613146219}]
{"$rows_left_out":17}
{"sheet":"Adj Primary Baseline Tariff","index":6,"n_rows":26,"n_cols":11,"rows_kept":26,"cut":false,"hidden":false,"merged":[[21,9,21,10],[2,2,2,3],[4,2,4,3],[5,7,5,8],[5,9,5,10],[21,7,21,8]]}
[]
[]
[null,null,"ADJUSTED PRIMARY BASELINE TARIFF"]
[]
[null,null,"Adjusted Primary Baseline Tariff after costing Free Basic Electricity."]
[null,null,null,null,null,null,null,"COST TO FREE BASIC ELECTRICITY",null,{"$f":"Menu!$J$4","v":"SA RANDS"}]
[null,null,"VARIABLE COSTS PER CONSUMER GROUP","TARIFF",null,null,null,"CONSUMER","ELECTRICITY DEMAND","REVENUE","FREE BASIC ELECTR. COST"]
[null,1,{"$f":"IF('Data Capture Costs'!C42=\"\",\"\",'Data Capture Costs'!C42)","v":"DOMESTIC - LOW INCOME (KwH)"},{"$f":"IF('Data Capture Demand'!E12=0,0,'Data Capture Costs'!J61/'Data Capture Demand'!E12)","v":0},null,null,null,"OTHER CONSUMPTION",null,{"$f":"'Data Capture Costs'!E75","v":15670000}]
[null,2,{"$f":"IF('Data Capture Costs'!C43=\"\",\"\",'Data Capture Costs'!C43)","v":"DOMESTIC - PRE-PAID (KwH)"},{"$f":"IF('Data Capture Demand'!E21=0,0,'Data Capture Costs'!J62/'Data Capture Demand'!E21)","v":1.037479867505394},null,null,null,"Domestic (Free Basic Electricity) Consumption",{"$f":"'Data Capture Demand'!E12","v":2750000},{"$f":"'Data Capture Costs'!E42","v":1950000},{"$f":"I9*'Primary Baseline Tariff'!D9","v":2537321.2934435974}]
[null,3,{"$f":"IF('Data Capture Costs'!C44=\"\",\"\",'Data Capture Costs'!C44)","v":"DOMESTIC - METERED SINGLE PHASE (KwH)"},{"$f":"IF('Data Capture Demand'!E30=0,0,'Data Capture Costs'!J63/'Data Capture Demand'!E30)","v":1.1810953182108255}]
{"$rows_left_out":17}
{"sheet":"Strategic Decisions","index":7,"n_rows":27,"n_cols":56,"rows_kept":27,"cut":false,"hidden":false,"merged":[[2,2,2,5],[3,2,3,5],[15,2,15,5]]}
[null,null,null,null,null,null,null,null,null,null,null,null,null,null,null,null,null,null,null,null,null,null,null,null,null,null,null,null,null,null,null,null,null,null,null,null,null,null,null,null,null,null,null,null,null,null,null,null,null,null,null,null,null,null,null,"Yes"]
[]
[null,null,"STRATEGIC DECISIONS",null,null,null,null,null,null,"Changes to Variable Costs"]
[null,null,null,null,null,null,null,null,null,{"$f":"$D$8+$F$8","v":0},null,null,null,null,null,null,null,null,null,null,null,null,null,null,null,null,null,null,null,null,null,null,null,null,null,null,null,null,null,null,null,null,null,null,null,null,null,null,null,null,null,null,null,null,null,"No"]
[null,null,"FINANCIAL DECISIONS","AMOUNT","%","% AMT",null,null,null,{"$f":"$D$13+$F$13","v":0}]
[null,1,"Do you wish to achieve a Surplus on this service?","YES",null,null,null,null,null,{"$f":"$D$19+$F$19","v":0}]
[null,null,null,"NO",null,null,null,null,null,"TOTAL SUBSIDY"]
[null,null,"Enter Size of the Surplus",0,0,{"$f":"E8%*'Data Capture Costs'!$D$6","v":0},null,null,null,{"$f":"SUM(J4-J5+J6)","v":0}]
[]
[null,null,null,null,null,null,null,null,null,"Subsidy Amt"]
{"$rows_left_out":18}
{"sheet":"Revised Primary Baseline Tariff","index":8,"n_rows":26,"n_cols":4,"rows_kept":26,"cut":false,"hidden":false,"merged":[[2,2,2,3],[4,2,4,3]]}
[]
[]
[null,null,"REVISED PRIMARY BASELINE TARIFF"]
[]
[null,null,"After Strategic Decisions this is the revised tariff."]
[]
[null,null,"VARIABLE COSTS PER CONSUMER GROUP","TARIFF"]
[null,1,{"$f":"IF('Data Capture Costs'!C42=\"\",\"\",'Data Capture Costs'!C42)","v":"DOMESTIC - LOW INCOME (KwH)"},0]
[null,2,{"$f":"IF('Data Capture Costs'!C43=\"\",\"\",'Data Capture Costs'!C43)","v":"DOMESTIC - PRE-PAID (KwH)"},{"$f":"IF('Data Capture Demand'!E21=0,0,'Data Capture Costs'!M62/'Data Capture Demand'!E21)","v":1.037479867505394}]
[null,3,{"$f":"IF('Data Capture Costs'!C44=\"\",\"\",'Data Capture Costs'!C44)","v":"DOMESTIC - METERED SINGLE PHASE (KwH)"},{"$f":"IF('Data Capture Demand'!E30=0,0,'Data Capture Costs'!M63/'Data Capture Demand'!E30)","v":1.1810953182108255}]
{"$rows_left_out":17}
{"sheet":"Test Afford of Variable Tariff","index":9,"n_rows":106,"n_cols":16,"rows_kept":106,"cut":false,"hidden":false,"merged":[[103,5,103,6],[2,2,2,15],[4,5,4,6],[4,10,4,12],[4,2,5,2],[4,3,5,3],[4,4,5,4],[4,7,4,8],[103,11,103,12]]}
[]
[]
[null,null,"CURRENT & REVISED TARIFF COMPARISON - VARIABLE CONSUMPTION"]
[]
[null,null,{"$f":"'Data Capture Demand'!C8","v":"CONSUMER"},{"$f":"'Data Capture Demand'!D8","v":"CONSUMPTION LEVEL"},{"$f":"'Data Capture Demand'!E8&\" (\"&Menu!J4&\")\"","v":"UNITS OF DEMAND (SA RANDS)"},"CURRENT ACTUAL",null,"REVISED TARIFF",null,null,"AFFORDABILITY ADJUSTMENT TO REVISED PRIMARY BASELINE",null,null,null,"Current Actual - Revised","PROFIT\\LOSS"]
[null,null,null,null,null,"TARIFF (Historical)","REVENUE","TARIFF","REVENUE",null,"% CHANGE","TARIFF","REVENUE",null,"TARIFF","REVENUE"]
[null,null,{"$f":"IF('Data Capture Demand'!C10=\"\",\"\",'Data Capture Demand'!C10)","v":"Domestic Low Income Pre-paid"},{"$f":"IF('Data Capture Demand'!D10=\"\",\"\",'Data Capture Demand'!D10)","v":""},{"$f":"'Data Capture Demand'!E10","v":2750000},{"$f":"'Data Capture Demand'!H10","v":0.78},{"$f":"SUM('Data Capture Demand'!G10*F7)","v":1950000},{"$f":"'Revised Primary Baseline Tariff'!$D$8","v":0},{"$f":"SUM(E7*H7)","v":0},null,0,{"$f":"SUM(H7*K7%)+H7","v":0},{"$f":"E7*L7","v":0},null,{"$f":"L7-F7","v":-0.78},{"$f":"M7-G7","v":-1950000}]
[null,null,{"$f":"IF('Data Capture Demand'!C11=\"\",\"\",'Data Capture Demand'!C11)","v":"Domestic Low Income Metered"},{"$f":"IF('Data Capture Demand'!D11=\"\",\"\",'Data Capture Demand'!D11)","v":""},{"$f":"'Data Capture Demand'!E11","v":0},{"$f":"'Data Capture Demand'!H11","v":0.72},{"$f":"SUM('Data Capture Demand'!G11*F8)","v":0},{"$f":"'Revised Primary Baseline Tariff'!$D$8","v":0},{"$f":"SUM(E8*H8)","v":0},null,0,{"$f":"SUM(H8*K8%)+H8","v":0},{"$f":"E8*L8","v":0},null,{"$f":"L8-F8","v":-0.72},{"$f":"M8-G8","v":0}]
[null,null,{"$f":"'Data Capture Demand'!C9&\" TOTAL\"","v":"DOMESTIC - LOW INCOME (KwH) TOTAL"},null,{"$f":"SUM(E7:E8)","v":2750000},null,{"$f":"SUM(G7:G8)","v":1950000},null,{"$f":"SUM(I7:I8)","v":0},null,null,null,{"$f":"SUM(M7:M8)","v":0},null,null,{"$f":"SUM(P7:P8)","v":-1950000}]
[null,null,{"$f":"IF('Data Capture Demand'!C15=\"\",\"\",'Data Capture Demand'!C15)","v":"Domestic Pre-Paid Type 1"},{"$f":"IF('Data Capture Demand'!D15=\"\",\"\",'Data Capture Demand'!D15)","v":""},{"$f":"'Data Capture Demand'!E15","v":1650000},{"$f":"'Data Capture Demand'!H15","v":0.78},{"$f":"SUM('Data Capture Demand'!G15*F10)","v":1170000},{"$f":"'Revised Primary Baseline Tariff'!$D$9","v":1.037479867505394},{"$f":"SUM(E10*H10)","v":1711841.7813839002},null,0,{"$f":"SUM(H10*K10%)+H10","v":1.037479867505394},1711841.7813839002,null,{"$f":"L10-F10","v":0.25747986750539398},{"$f":"M10-G10","v":541841.7813839002}]
{"$rows_left_out":97}
{"sheet":"Test Afford of Fixed Tariff","index":10,"n_rows":35,"n_cols":16,"rows_kept":35,"cut":false,"hidden":false,"merged":[[32,6,32,7],[2,2,2,15],[4,2,5,2],[4,3,5,3],[4,4,5,4],[4,5,4,6],[4,7,4,8],[4,10,4,12],[32,11,32,12]]}
[]
[]
[null,null,"CURRENT & REVISED TARIFF COMPARISON - FIXED FACILITY PER YEAR"]
[]
[null,null,{"$f":"'Data Capture Demand'!C8","v":"CONSUMER"},{"$f":"'Data Capture Demand'!D8","v":"CONSUMPTION LEVEL"},{"$f":"'Data Capture Demand'!E8&\" (\"&Menu!J4&\")\"","v":"UNITS OF DEMAND (SA RANDS)"},"CURRENT ACTUAL",null,"REVISED TARIFF",null,null,"AFFORDABILITY ADJUSTMENT  TO REVISED PRIMARY BASELINE",null,null,null,"Current Actual - Revised","PROFIT\\LOSS"]
[null,null,null,null,null,"TARIFF","REVENUE","TARIFF","REVENUE",null,"% CHANGE","TARIFF","REVENUE",null,"TARIFF","REVENUE"]
[null,null,{"$f":"IF('Data Capture Users'!C10=\"\",\"\",'Data Capture Users'!C10)","v":"Domestic Low Income Pre-paid"},null,{"$f":"'Data Capture Users'!D10","v":2200},{"$f":"'Data Capture Users'!G10","v":0},{"$f":"'Data Capture Users'!F10*F7","v":0},0,{"$f":"SUM(E7*H7)","v":0},null,0,{"$f":"SUM(H7*K7%)+H7","v":0},{"$f":"E7*L7","v":0},null,{"$f":"L7-F7","v":0},{"$f":"M7-G7","v":0}]
[null,null,{"$f":"IF('Data Capture Users'!C11=\"\",\"\",'Data Capture Users'!C11)","v":"Domestic Low Income Metered"},null,{"$f":"'Data Capture Users'!D11","v":0},{"$f":"'Data Capture Users'!G11","v":600},{"$f":"'Data Capture Users'!F11*F8","v":0},0,{"$f":"SUM(E8*H8)","v":0},null,0,{"$f":"SUM(H8*K8%)+H8","v":0},{"$f":"E8*L8","v":0},null,{"$f":"L8-F8","v":-600},{"$f":"M8-G8","v":0}]
[null,null,{"$f":"'Data Capture Users'!C9&\" TOTAL\"","v":"DOMESTIC - LOW INCOME (KwH) TOTAL"},null,{"$f":"SUM(E7:E8)","v":2200},null,{"$f":"SUM(G7:G8)","v":0},null,{"$f":"SUM(I7:I8)","v":0},null,null,null,{"$f":"SUM(M7:M8)","v":0},null,null,{"$f":"SUM(P7:P8)","v":0}]
[null,null,{"$f":"IF('Data Capture Users'!C15=\"\",\"\",'Data Capture Users'!C15)","v":"Availablility Fees for Vacant Stands"},null,{"$f":"'Data Capture Users'!D15","v":0},{"$f":"'Data Capture Users'!G15","v":0},{"$f":"'Data Capture Users'!F15*F10","v":0},{"$f":"'Revised Primary Baseline Tariff'!$D$26","v":736.81818181818187},{"$f":"SUM(E10*H10)","v":0},null,0,{"$f":"SUM(H10*K10%)+H10","v":736.81818181818187},{"$f":"E10*L10","v":0},null,{"$f":"L10-F10","v":736.81818181818187},0]
{"$rows_left_out":26}
{"sheet":"Summary of Tariff Comparison","index":11,"n_rows":14,"n_cols":16,"rows_kept":14,"cut":false,"hidden":false,"merged":[[11,5,11,6],[11,11,11,12],[2,2,2,15],[4,2,5,2],[4,3,5,3],[4,4,5,4],[4,5,4,6],[4,7,4,8],[4,10,4,12]]}
[]
[]
[null,null,"SUMMARY: VARIABLE & FIXED PROFIT AND LOSS PER YEAR"]
[]
[null,null,{"$f":"'Data Capture Demand'!C8","v":"CONSUMER"},{"$f":"'Data Capture Demand'!D8","v":"CONSUMPTION LEVEL"},{"$f":"'Data Capture Demand'!E8&\" (\"&Menu!J4&\")\"","v":"UNITS OF DEMAND (SA RANDS)"},"CURRENT ACTUAL",null,"REVISED TARIFF",null,null,"AFFORDABILITY ADJUSTMENT  TO REVISED PRIMARY BASELINE",null,null,null,"Current Actual - Revised","PROFIT\\LOSS"]
[null,null,null,null,null,"TARIFF","REVENUE","TARIFF","REVENUE",null,"% CHANGE","TARIFF","REVENUE",null,"TARIFF","REVENUE"]
[]
[null,null,"TOTAL VARIABLE CONSUMPTION",null,{"$f":"'Test Afford of Variable Tariff'!E102","v":19100000},null,{"$f":"'Test Afford of Variable Tariff'!G102","v":15670000},null,{"$f":"'Test Afford of Variable Tariff'!I102","v":20945000},null,null,null,{"$f":"'Test Afford of Variable Tariff'!M102","v":20945000},null,null,{"$f":"'Test Afford of Variable Tariff'!P102","v":5275000.0000000019}]
[]
[null,null,"TOTAL FIXED CONSUMPTION",null,{"$f":"'Test Afford of Fixed Tariff'!E31","v":11000},null,{"$f":"'Test Afford of Fixed Tariff'!G31","v":6600000},null,{"$f":"'Test Afford of Fixed Tariff'!I31","v":8105000},null,null,null,{"$f":"'Test Afford of Fixed Tariff'!M31","v":8105000},null,null,{"$f":"'Test Afford of Fixed Tariff'!P31","v":1505000.0000000005}]
{"$rows_left_out":4}